Reaction Details
TargetDual specificity protein phosphatase CDC14A
LigandBDBM50420258
Substrate/Competitorn/a
Meas. Tech.ChEMBL_1513411 (CHEMBL3611566)
IC50 300000±n/a nM
Citation He, RYu, ZHZhang, RYWu, LGunawan, AMLane, BSShim, JSZeng, LFHe, YChen, LWells, CDLiu, JOZhang, ZY Exploring the Existing Drug Space for Novel pTyr Mimetic and SHP2 Inhibitors. ACS Med Chem Lett6:782-6 (2015) 
 
Dual specificity protein phosphatase CDC14A
Name:Dual specificity protein phosphatase CDC14A
Type:n/a
Mol. Mass.:66598.40
Organism:Homo sapiens (Human)
Description:Q9UNH5
Residue:594
BDBM50420258
NameBDBM50420258
Synonyms:CEFSULODIN
TypeSmall organic molecule
Emp. Form.C22H21N4O8S2
Mol. Mass.533.554
SMILESNC(=O)c1cc[n+](CC2=C(N3[C@H](SC2)[C@H](NC(=O)C(c2ccccc2)S(O)(=O)=O)C3=O)C(O)=O)cc1