Reaction Details
TargetReceptor-type tyrosine-protein phosphatase epsilon
LigandBDBM50420258
Substrate/Competitorn/a
Meas. Tech.ChEMBL_1513406 (CHEMBL3611561)
IC50>200000±n/a nM
Citation He, RYu, ZHZhang, RYWu, LGunawan, AMLane, BSShim, JSZeng, LFHe, YChen, LWells, CDLiu, JOZhang, ZY Exploring the Existing Drug Space for Novel pTyr Mimetic and SHP2 Inhibitors. ACS Med Chem Lett6:782-6 (2015) 
 
Receptor-type tyrosine-protein phosphatase epsilon
Name:Receptor-type tyrosine-protein phosphatase epsilon
Type:Protein
Mol. Mass.:80646.31
Organism:Homo sapiens (Human)
Description:P23469
Residue:700
BDBM50420258
NameBDBM50420258
Synonyms:CEFSULODIN
TypeSmall organic molecule
Emp. Form.C22H21N4O8S2
Mol. Mass.533.554
SMILESNC(=O)c1cc[n+](CC2=C(N3[C@H](SC2)[C@H](NC(=O)C(c2ccccc2)S(O)(=O)=O)C3=O)C(O)=O)cc1