Reaction Details
TargetTyrosine-protein kinase JAK3
LigandBDBM50121386
Substrate/Competitorn/a
Meas. Tech.ChEMBL_1518801 (CHEMBL3625475)
IC50 230±n/a nM
Citation Hart, ACSchroeder, GMWan, HGrebinski, JInghrim, JKempson, JGuo, JPitts, WJTokarski, JSSack, JSKhan, JALippy, JLorenzi, MVYou, DMcDevitt, TVuppugalla, RZhang, YLombardo, LJTrainor, GLPurandare, AV Structure-Based Design of Selective Janus Kinase 2 Imidazo[4,5-d]pyrrolo[2,3-b]pyridine Inhibitors. ACS Med Chem Lett6:845-9 (2015) 
 
Tyrosine-protein kinase JAK3
Name:Tyrosine-protein kinase JAK3
Type:Protein
Mol. Mass.:125111.08
Organism:Homo sapiens (Human)
Description:P52333
Residue:1124
BDBM50121386
NameBDBM50121386
Synonyms:CHEMBL3622127
TypeSmall organic molecule
Emp. Form.C20H26N6O3
Mol. Mass.398.4588
SMILESCNc1nc2n(C[C@H](O)CO)c(cc2c2n(C)cnc12)C(=O)N(C1CC1)C1CC1