Reaction Details
TargetTyrosine-protein kinase JAK2
LigandBDBM50121383
Substrate/Competitorn/a
Meas. Tech.ChEMBL_1518800 (CHEMBL3625474)
IC50 350±n/a nM
Citation Hart, ACSchroeder, GMWan, HGrebinski, JInghrim, JKempson, JGuo, JPitts, WJTokarski, JSSack, JSKhan, JALippy, JLorenzi, MVYou, DMcDevitt, TVuppugalla, RZhang, YLombardo, LJTrainor, GLPurandare, AV Structure-Based Design of Selective Janus Kinase 2 Imidazo[4,5-d]pyrrolo[2,3-b]pyridine Inhibitors. ACS Med Chem Lett6:845-9 (2015) 
 
Tyrosine-protein kinase JAK2
Name:Tyrosine-protein kinase JAK2
Type:Protein
Mol. Mass.:130684.68
Organism:Homo sapiens (Human)
Description:O60674
Residue:1132
BDBM50121383
NameBDBM50121383
Synonyms:CHEMBL3622130
TypeSmall organic molecule
Emp. Form.C19H24N6O
Mol. Mass.352.4335
SMILESCCn1c(cc2c1nc(NC)c1ncn(C)c21)C(=O)N(C1CC1)C1CC1