Reaction Details
TargetTyrosine-protein kinase JAK2
LigandBDBM50121377
Substrate/Competitorn/a
Meas. Tech.ChEMBL_1518799 (CHEMBL3625473)
IC50 2.1±n/a nM
Citation Hart, ACSchroeder, GMWan, HGrebinski, JInghrim, JKempson, JGuo, JPitts, WJTokarski, JSSack, JSKhan, JALippy, JLorenzi, MVYou, DMcDevitt, TVuppugalla, RZhang, YLombardo, LJTrainor, GLPurandare, AV Structure-Based Design of Selective Janus Kinase 2 Imidazo[4,5-d]pyrrolo[2,3-b]pyridine Inhibitors. ACS Med Chem Lett6:845-9 (2015) 
 
Tyrosine-protein kinase JAK2
Name:Tyrosine-protein kinase JAK2
Type:Protein
Mol. Mass.:130684.68
Organism:Homo sapiens (Human)
Description:O60674
Residue:1132
BDBM50121377
NameBDBM50121377
Synonyms:CHEMBL3622136
TypeSmall organic molecule
Emp. Form.C22H25N7OS
Mol. Mass.435.545
SMILESCCn1c(cc2c1nc(Nc1ncc(C)s1)c1ncn(C)c21)C(=O)N(C1CC1)C1CC1