Reaction Details
TargetTyrosine-protein kinase JAK3
LigandBDBM50121388
Substrate/Competitorn/a
Meas. Tech.ChEMBL_1518801 (CHEMBL3625475)
IC50 670±n/a nM
Citation Hart, ACSchroeder, GMWan, HGrebinski, JInghrim, JKempson, JGuo, JPitts, WJTokarski, JSSack, JSKhan, JALippy, JLorenzi, MVYou, DMcDevitt, TVuppugalla, RZhang, YLombardo, LJTrainor, GLPurandare, AV Structure-Based Design of Selective Janus Kinase 2 Imidazo[4,5-d]pyrrolo[2,3-b]pyridine Inhibitors. ACS Med Chem Lett6:845-9 (2015) 
 
Tyrosine-protein kinase JAK3
Name:Tyrosine-protein kinase JAK3
Type:Protein
Mol. Mass.:125111.08
Organism:Homo sapiens (Human)
Description:P52333
Residue:1124
BDBM50121388
NameBDBM50121388
Synonyms:CHEMBL3622140
TypeSmall organic molecule
Emp. Form.C19H28N6O3
Mol. Mass.388.464
SMILESCCN(C(C)C)C(=O)c1cc2c(nc(NC)c3ncn(C)c23)n1C[C@H](O)CO