Reaction Details
TargetProto-oncogene tyrosine-protein kinase Src
LigandBDBM50121391
Substrate/Competitorn/a
Meas. Tech.ChEMBL_1518812 (CHEMBL3625486)
IC50>2000±n/a nM
Citation Hart, ACSchroeder, GMWan, HGrebinski, JInghrim, JKempson, JGuo, JPitts, WJTokarski, JSSack, JSKhan, JALippy, JLorenzi, MVYou, DMcDevitt, TVuppugalla, RZhang, YLombardo, LJTrainor, GLPurandare, AV Structure-Based Design of Selective Janus Kinase 2 Imidazo[4,5-d]pyrrolo[2,3-b]pyridine Inhibitors. ACS Med Chem Lett6:845-9 (2015) 
 
Proto-oncogene tyrosine-protein kinase Src
Name:Proto-oncogene tyrosine-protein kinase Src
Type:Protein
Mol. Mass.:59838.60
Organism:Homo sapiens (Human)
Description:P12931
Residue:536
BDBM50121391
NameBDBM50121391
Synonyms:CHEMBL3622137
TypeSmall organic molecule
Emp. Form.C23H27N7OS
Mol. Mass.449.572
SMILESCCn1c(cc2c1nc(Nc1nc(C)c(C)s1)c1ncn(C)c21)C(=O)N(C1CC1)C1CC1