Reaction Details
TargetNon-receptor tyrosine-protein kinase TYK2
LigandBDBM50121380
Substrate/Competitorn/a
Meas. Tech.ChEMBL_1518803 (CHEMBL3625477)
IC50 290±n/a nM
Citation Hart, ACSchroeder, GMWan, HGrebinski, JInghrim, JKempson, JGuo, JPitts, WJTokarski, JSSack, JSKhan, JALippy, JLorenzi, MVYou, DMcDevitt, TVuppugalla, RZhang, YLombardo, LJTrainor, GLPurandare, AV Structure-Based Design of Selective Janus Kinase 2 Imidazo[4,5-d]pyrrolo[2,3-b]pyridine Inhibitors. ACS Med Chem Lett6:845-9 (2015) 
 
Non-receptor tyrosine-protein kinase TYK2
Name:Non-receptor tyrosine-protein kinase TYK2
Type:Protein
Mol. Mass.:133666.03
Organism:Homo sapiens (Human)
Description:P29597
Residue:1187
BDBM50121380
NameBDBM50121380
Synonyms:CHEMBL3622133
TypeSmall organic molecule
Emp. Form.C22H29N7O3
Mol. Mass.439.5108
SMILESCCn1c(cc2c1nc(NC(=O)NCCOC)c1ncn(C)c21)C(=O)N(C1CC1)C1CC1