Reaction Details
TargetTyrosine-protein kinase JAK3
LigandBDBM50121391
Substrate/Competitorn/a
Meas. Tech.ChEMBL_1518801 (CHEMBL3625475)
IC50 160±n/a nM
Citation Hart, ACSchroeder, GMWan, HGrebinski, JInghrim, JKempson, JGuo, JPitts, WJTokarski, JSSack, JSKhan, JALippy, JLorenzi, MVYou, DMcDevitt, TVuppugalla, RZhang, YLombardo, LJTrainor, GLPurandare, AV Structure-Based Design of Selective Janus Kinase 2 Imidazo[4,5-d]pyrrolo[2,3-b]pyridine Inhibitors. ACS Med Chem Lett6:845-9 (2015) 
 
Tyrosine-protein kinase JAK3
Name:Tyrosine-protein kinase JAK3
Type:Protein
Mol. Mass.:125111.08
Organism:Homo sapiens (Human)
Description:P52333
Residue:1124
BDBM50121391
NameBDBM50121391
Synonyms:CHEMBL3622137
TypeSmall organic molecule
Emp. Form.C23H27N7OS
Mol. Mass.449.572
SMILESCCn1c(cc2c1nc(Nc1nc(C)c(C)s1)c1ncn(C)c21)C(=O)N(C1CC1)C1CC1