Reaction Details
TargetMisshapen-like kinase 1
LigandBDBM50134771
Substrate/Competitorn/a
Meas. Tech.ChEBML_1549428
IC50 8.0±n/a nM
Citation Ammirati, MBagley, SWBhattacharya, SKBuckbinder, LCarlo, AAConrad, RCortes, CDow, RLDowling, MSEl-Kattan, AFord, KGuimarães, CRHepworth, DJiao, WLaPerle, JLiu, SLondregan, ALoria, PMMathiowetz, AMMunchhof, MOrr, STPetersen, DNPrice, DASkoura, ASmith, ACWang, J Discovery of an in Vivo Tool to Establish Proof-of-Concept for MAP4K4-Based Antidiabetic Treatment. ACS Med Chem Lett6:1128-33 (2015) 
 
Misshapen-like kinase 1
Name:Misshapen-like kinase 1
Type:PROTEIN
Mol. Mass.:149838.92
Organism:Homo sapiens (Human)
Description:ChEMBL_793919
Residue:1332
BDBM50134771
NameBDBM50134771
Synonyms:CHEMBL3754515
TypeSmall organic molecule
Emp. Form.C16H13ClN4
Mol. Mass.296.754
SMILESNc1ccc(cn1)-c1cnc(N)c(c1)-c1ccc(Cl)cc1