Reaction Details
TargetCytochrome P450 1A2
LigandBDBM50134771
Substrate/Competitorn/a
Meas. Tech.ChEBML_1549435
IC50 3000±n/a nM
Citation Ammirati, MBagley, SWBhattacharya, SKBuckbinder, LCarlo, AAConrad, RCortes, CDow, RLDowling, MSEl-Kattan, AFord, KGuimarães, CRHepworth, DJiao, WLaPerle, JLiu, SLondregan, ALoria, PMMathiowetz, AMMunchhof, MOrr, STPetersen, DNPrice, DASkoura, ASmith, ACWang, J Discovery of an in Vivo Tool to Establish Proof-of-Concept for MAP4K4-Based Antidiabetic Treatment. ACS Med Chem Lett6:1128-33 (2015) 
 
Cytochrome P450 1A2
Name:Cytochrome P450 1A2
Type:Enzyme
Mol. Mass.:58423.38
Organism:Homo sapiens (Human)
Description:P05177
Residue:516
BDBM50134771
NameBDBM50134771
Synonyms:CHEMBL3754515
TypeSmall organic molecule
Emp. Form.C16H13ClN4
Mol. Mass.296.754
SMILESNc1ccc(cn1)-c1cnc(N)c(c1)-c1ccc(Cl)cc1