Reaction Details
TargetMitogen-activated protein kinase kinase kinase kinase 4
LigandBDBM50138128
Substrate/Competitorn/a
Meas. Tech.ChEMBL_1549420 (CHEMBL3755427)
IC50 590±n/a nM
Citation Ammirati, MBagley, SWBhattacharya, SKBuckbinder, LCarlo, AAConrad, RCortes, CDow, RLDowling, MSEl-Kattan, AFord, KGuimarães, CRHepworth, DJiao, WLaPerle, JLiu, SLondregan, ALoria, PMMathiowetz, AMMunchhof, MOrr, STPetersen, DNPrice, DASkoura, ASmith, ACWang, J Discovery of an in Vivo Tool to Establish Proof-of-Concept for MAP4K4-Based Antidiabetic Treatment. ACS Med Chem Lett6:1128-33 (2015) 
 
Mitogen-activated protein kinase kinase kinase kinase 4
Name:Mitogen-activated protein kinase kinase kinase kinase 4
Type:Serine/threonine-protein kinase
Mol. Mass.:142114.73
Organism:Homo sapiens (Human)
Description:O95819
Residue:1239
BDBM50138128
NameBDBM50138128
Synonyms:CHEMBL3754730
TypeSmall organic molecule
Emp. Form.C16H12ClN3O
Mol. Mass.297.739
SMILESNc1ncc(cc1-c1ccc(Cl)cc1)-c1cc[nH]c(=O)c1