Reaction Details
TargetMuscarinic acetylcholine receptor M1
LigandBDBM50135190
Substrate/Competitorn/a
Meas. Tech.ChEMBL_1545717 (CHEMBL3748814)
EC50 101±n/a nM
Citation Davoren, JEO'Neil, SVAnderson, DPBrodney, MAChenard, LDlugolenski, KEdgerton, JRGreen, MGarnsey, MGrimwood, SHarris, ARKauffman, GWLaChapelle, ELazzaro, JTLee, CWLotarski, SMNason, DMObach, RSReinhart, VSalomon-Ferrer, RSteyn, SJWebb, DYan, JZhang, L Design and optimization of selective azaindole amide M1 positive allosteric modulators. Bioorg Med Chem Lett26:650-5 (2016) 
 
Muscarinic acetylcholine receptor M1
Name:Muscarinic acetylcholine receptor M1
Type:Protein
Mol. Mass.:51442.54
Organism:Homo sapiens (Human)
Description:P11229
Residue:460
BDBM50135190
NameBDBM50135190
Synonyms:CHEMBL3745973
TypeSmall organic molecule
Emp. Form.C24H25N5O2
Mol. Mass.415.4876
SMILESO[C@H]1CCCC[C@@H]1NC(=O)c1cn(Cc2ccc(cc2)-n2cccn2)c2cccnc12