Reaction Details
TargetMuscarinic acetylcholine receptor M1
LigandBDBM50135196
Substrate/Competitorn/a
Meas. Tech.ChEMBL_1545717 (CHEMBL3748814)
EC50 478±n/a nM
Citation Davoren, JEO'Neil, SVAnderson, DPBrodney, MAChenard, LDlugolenski, KEdgerton, JRGreen, MGarnsey, MGrimwood, SHarris, ARKauffman, GWLaChapelle, ELazzaro, JTLee, CWLotarski, SMNason, DMObach, RSReinhart, VSalomon-Ferrer, RSteyn, SJWebb, DYan, JZhang, L Design and optimization of selective azaindole amide M1 positive allosteric modulators. Bioorg Med Chem Lett26:650-5 (2016) 
 
Muscarinic acetylcholine receptor M1
Name:Muscarinic acetylcholine receptor M1
Type:Protein
Mol. Mass.:51442.54
Organism:Homo sapiens (Human)
Description:P11229
Residue:460
BDBM50135196
NameBDBM50135196
Synonyms:CHEMBL3745995
TypeSmall organic molecule
Emp. Form.C22H22N4O2
Mol. Mass.374.4357
SMILESO[C@H]1CCCC[C@@H]1NC(=O)c1cn(Cc2ccc(cc2)C#N)c2cccnc12