Reaction Details
TargetMuscarinic acetylcholine receptor M1
LigandBDBM50135206
Substrate/Competitorn/a
Meas. Tech.ChEMBL_1545717 (CHEMBL3748814)
EC50 258±n/a nM
Citation Davoren, JEO'Neil, SVAnderson, DPBrodney, MAChenard, LDlugolenski, KEdgerton, JRGreen, MGarnsey, MGrimwood, SHarris, ARKauffman, GWLaChapelle, ELazzaro, JTLee, CWLotarski, SMNason, DMObach, RSReinhart, VSalomon-Ferrer, RSteyn, SJWebb, DYan, JZhang, L Design and optimization of selective azaindole amide M1 positive allosteric modulators. Bioorg Med Chem Lett26:650-5 (2016) 
 
Muscarinic acetylcholine receptor M1
Name:Muscarinic acetylcholine receptor M1
Type:Protein
Mol. Mass.:51442.54
Organism:Homo sapiens (Human)
Description:P11229
Residue:460
BDBM50135206
NameBDBM50135206
Synonyms:CHEMBL3747724
TypeSmall organic molecule
Emp. Form.C22H19N7O
Mol. Mass.397.4326
SMILESCn1ccc(NC(=O)c2cn(Cc3ccc(cc3)-n3cccn3)c3cccnc23)n1