Reaction Details
TargetMuscarinic acetylcholine receptor M1
LigandBDBM50135216
Substrate/Competitorn/a
Meas. Tech.ChEMBL_1545717 (CHEMBL3748814)
EC50 211±n/a nM
Citation Davoren, JEO'Neil, SVAnderson, DPBrodney, MAChenard, LDlugolenski, KEdgerton, JRGreen, MGarnsey, MGrimwood, SHarris, ARKauffman, GWLaChapelle, ELazzaro, JTLee, CWLotarski, SMNason, DMObach, RSReinhart, VSalomon-Ferrer, RSteyn, SJWebb, DYan, JZhang, L Design and optimization of selective azaindole amide M1 positive allosteric modulators. Bioorg Med Chem Lett26:650-5 (2016) 
 
Muscarinic acetylcholine receptor M1
Name:Muscarinic acetylcholine receptor M1
Type:Protein
Mol. Mass.:51442.54
Organism:Homo sapiens (Human)
Description:P11229
Residue:460
BDBM50135216
NameBDBM50135216
Synonyms:CHEMBL3747004
TypeSmall organic molecule
Emp. Form.C25H27N5O3
Mol. Mass.445.5136
SMILESCc1cnc2c(cn(Cc3ccc(cc3)-c3ccn(C)n3)c2c1)C(=O)N[C@H]1CCOC[C@@H]1O