Reaction Details
TargetMuscarinic acetylcholine receptor M1
LigandBDBM50135218
Substrate/Competitorn/a
Meas. Tech.ChEMBL_1545717 (CHEMBL3748814)
EC50 65±n/a nM
Citation Davoren, JEO'Neil, SVAnderson, DPBrodney, MAChenard, LDlugolenski, KEdgerton, JRGreen, MGarnsey, MGrimwood, SHarris, ARKauffman, GWLaChapelle, ELazzaro, JTLee, CWLotarski, SMNason, DMObach, RSReinhart, VSalomon-Ferrer, RSteyn, SJWebb, DYan, JZhang, L Design and optimization of selective azaindole amide M1 positive allosteric modulators. Bioorg Med Chem Lett26:650-5 (2016) 
 
Muscarinic acetylcholine receptor M1
Name:Muscarinic acetylcholine receptor M1
Type:Protein
Mol. Mass.:51442.54
Organism:Homo sapiens (Human)
Description:P11229
Residue:460
BDBM50135218
NameBDBM50135218
Synonyms:CHEMBL3747781
TypeSmall organic molecule
Emp. Form.C23H23N5O3
Mol. Mass.417.4604
SMILESO[C@H]1COCC[C@@H]1NC(=O)c1cn(Cc2ccc(cc2)-c2cc[nH]n2)c2cccnc12