Reaction Details
TargetCoagulation factor XI
LigandBDBM50136571
Substrate/Competitorn/a
Meas. Tech.ChEMBL_1548350 (CHEMBL3756134)
Ki 7.1±n/a nM
Citation Smith, LMOrwat, MJHu, ZHan, WWang, CRossi, KAGilligan, PJPabbisetty, KBOsuna, HCorte, JRRendina, ARLuettgen, JMWong, PCNarayanan, RHarper, TWBozarth, JMCrain, EJWei, ARamamurthy, VMorin, PEXin, BZheng, JSeiffert, DAQuan, MLLam, PYWexler, RRPinto, DJ Novel phenylalanine derived diamides as Factor XIa inhibitors. Bioorg Med Chem Lett26:472-8 (2016) 
 
Coagulation factor XI
Name:Coagulation factor XI
Type:Enzyme
Mol. Mass.:70130.58
Organism:Homo sapiens (Human)
Description:P03951
Residue:625
BDBM50136571
NameBDBM50136571
Synonyms:CHEMBL3752830
TypeSmall organic molecule
Emp. Form.C29H27ClN6O4
Mol. Mass.559.015
SMILESCCCc1ccc(C[C@H](NC(=O)\C=C\c2cc(Cl)ccc2-n2cnnn2)C(=O)Nc2ccc(cc2)C(O)=O)cc1