Reaction Details
TargetPlasma kallikrein
LigandBDBM50136582
Substrate/Competitorn/a
Meas. Tech.ChEMBL_1548351 (CHEMBL3756135)
Ki 28±n/a nM
Citation Smith, LMOrwat, MJHu, ZHan, WWang, CRossi, KAGilligan, PJPabbisetty, KBOsuna, HCorte, JRRendina, ARLuettgen, JMWong, PCNarayanan, RHarper, TWBozarth, JMCrain, EJWei, ARamamurthy, VMorin, PEXin, BZheng, JSeiffert, DAQuan, MLLam, PYWexler, RRPinto, DJ Novel phenylalanine derived diamides as Factor XIa inhibitors. Bioorg Med Chem Lett26:472-8 (2016) 
 
Plasma kallikrein
Name:Plasma kallikrein
Type:Protein
Mol. Mass.:71391.16
Organism:Homo sapiens (Human)
Description:P03952
Residue:638
BDBM50136582
NameBDBM50136582
Synonyms:CHEMBL3754712
TypeSmall organic molecule
Emp. Form.C28H22ClN7O4
Mol. Mass.555.972
SMILESOc1cc(=O)[nH]c2ccc(NC(=O)[C@H](Cc3ccccc3)NC(=O)\C=C\c3cc(Cl)ccc3-n3cnnn3)cc12