Reaction Details
TargetCoagulation factor IX
LigandBDBM50136608
Substrate/Competitorn/a
Meas. Tech.ChEMBL_1548358 (CHEMBL3756142)
Ki>73000±n/a nM
Citation Smith, LMOrwat, MJHu, ZHan, WWang, CRossi, KAGilligan, PJPabbisetty, KBOsuna, HCorte, JRRendina, ARLuettgen, JMWong, PCNarayanan, RHarper, TWBozarth, JMCrain, EJWei, ARamamurthy, VMorin, PEXin, BZheng, JSeiffert, DAQuan, MLLam, PYWexler, RRPinto, DJ Novel phenylalanine derived diamides as Factor XIa inhibitors. Bioorg Med Chem Lett26:472-8 (2016) 
 
Coagulation factor IX
Name:Coagulation factor IX
Type:Enzyme
Mol. Mass.:51768.83
Organism:Homo sapiens (Human)
Description:P00740
Residue:461
BDBM50136608
NameBDBM50136608
Synonyms:CHEMBL3754069
TypeSmall organic molecule
Emp. Form.C26H21ClN6O4
Mol. Mass.516.936
SMILESOC(=O)c1ccc(NC(=O)[C@H](Cc2ccccc2)NC(=O)\C=C\c2cc(Cl)ccc2-n2cnnn2)cc1