Reaction Details
TargetKallikrein-1
LigandBDBM50136573
Substrate/Competitorn/a
Meas. Tech.ChEMBL_1548529 (CHEMBL3757186)
Ki>30000±n/a nM
Citation Smith, LMOrwat, MJHu, ZHan, WWang, CRossi, KAGilligan, PJPabbisetty, KBOsuna, HCorte, JRRendina, ARLuettgen, JMWong, PCNarayanan, RHarper, TWBozarth, JMCrain, EJWei, ARamamurthy, VMorin, PEXin, BZheng, JSeiffert, DAQuan, MLLam, PYWexler, RRPinto, DJ Novel phenylalanine derived diamides as Factor XIa inhibitors. Bioorg Med Chem Lett26:472-8 (2016) 
 
Kallikrein-1
Name:Kallikrein-1
Type:Enzyme
Mol. Mass.:28874.69
Organism:Homo sapiens (Human)
Description:P06870
Residue:262
BDBM50136573
NameBDBM50136573
Synonyms:CHEMBL3752047
TypeSmall organic molecule
Emp. Form.C32H32ClN9O5
Mol. Mass.658.107
SMILESCN1CCN(CC1)C(=O)Nc1ccc(C[C@H](NC(=O)\C=C\c2cc(Cl)ccc2-n2cnnn2)C(=O)Nc2ccc(cc2)C(O)=O)cc1