Reaction Details
TargetPlasma kallikrein
LigandBDBM50136577
Substrate/Competitorn/a
Meas. Tech.ChEMBL_1548351 (CHEMBL3756135)
Ki>6000±n/a nM
Citation Smith, LMOrwat, MJHu, ZHan, WWang, CRossi, KAGilligan, PJPabbisetty, KBOsuna, HCorte, JRRendina, ARLuettgen, JMWong, PCNarayanan, RHarper, TWBozarth, JMCrain, EJWei, ARamamurthy, VMorin, PEXin, BZheng, JSeiffert, DAQuan, MLLam, PYWexler, RRPinto, DJ Novel phenylalanine derived diamides as Factor XIa inhibitors. Bioorg Med Chem Lett26:472-8 (2016) 
 
Plasma kallikrein
Name:Plasma kallikrein
Type:Protein
Mol. Mass.:71391.16
Organism:Homo sapiens (Human)
Description:P03952
Residue:638
BDBM50136577
NameBDBM50136577
Synonyms:CHEMBL3752071
TypeSmall organic molecule
Emp. Form.C26H23ClN10O2
Mol. Mass.542.98
SMILESClc1ccc(c(CCNC(=O)[C@H](Cc2ccccc2)NC(=O)c2ccc(cc2)-c2nnn[nH]2)c1)-n1cnnn1