Reaction Details
TargetCoagulation factor XI
LigandBDBM50136613
Substrate/Competitorn/a
Meas. Tech.ChEMBL_1548350 (CHEMBL3756134)
Ki 46±n/a nM
Citation Smith, LMOrwat, MJHu, ZHan, WWang, CRossi, KAGilligan, PJPabbisetty, KBOsuna, HCorte, JRRendina, ARLuettgen, JMWong, PCNarayanan, RHarper, TWBozarth, JMCrain, EJWei, ARamamurthy, VMorin, PEXin, BZheng, JSeiffert, DAQuan, MLLam, PYWexler, RRPinto, DJ Novel phenylalanine derived diamides as Factor XIa inhibitors. Bioorg Med Chem Lett26:472-8 (2016) 
 
Coagulation factor XI
Name:Coagulation factor XI
Type:Enzyme
Mol. Mass.:70130.58
Organism:Homo sapiens (Human)
Description:P03951
Residue:625
BDBM50136613
NameBDBM50136613
Synonyms:CHEMBL3753374
TypeSmall organic molecule
Emp. Form.C26H21ClN6O4
Mol. Mass.516.936
SMILESOC(=O)c1cccc(NC(=O)[C@H](Cc2ccccc2)NC(=O)\C=C\c2cc(Cl)ccc2-n2cnnn2)c1