Reaction Details
TargetCholine kinase alpha
LigandBDBM50146014
Substrate/Competitorn/a
Meas. Tech.ChEMBL_1554261 (CHEMBL3766475)
IC50 20±n/a nM
Citation Zech, SGKohlmann, AZhou, TLi, FSquillace, RMParillon, LEGreenfield, MTMiller, DPQi, JThomas, RMWang, YXu, YMiret, JJShakespeare, WCZhu, XDalgarno, DC Novel Small Molecule Inhibitors of Choline Kinase Identified by Fragment-Based Drug Discovery. J Med Chem59:671-86 (2016) 
 
Choline kinase alpha
Name:Choline kinase alpha
Type:PROTEIN
Mol. Mass.:52248.44
Organism:Homo sapiens (Human)
Description:ChEMBL_1290064
Residue:457
BDBM50146014
NameBDBM50146014
Synonyms:CHEMBL3765554
TypeSmall organic molecule
Emp. Form.C27H35NO3
Mol. Mass.421.5717
SMILESO[C@@](CCc1ccccc1OC1CCOCC1)(C1CN2CCC1CC2)c1ccccc1