Reaction Details
TargetSphingosine 1-phosphate receptor 1
LigandBDBM50149574
Substrate/Competitorn/a
Meas. Tech.ChEMBL_1558236 (CHEMBL3772233)
EC50<31623±n/a nM
Citation Demont, EHBailey, JMBit, RABrown, JACampbell, CADeeks, NDowell, SJEldred, CGaskin, PGray, JRHaynes, AHirst, DJHolmes, DSKumar, UMorse, MAOsborne, GJRenaux, JFSeal, GASmethurst, CATaylor, SWatson, RWillis, RWitherington, J Discovery of Tetrahydropyrazolopyridine as Sphingosine 1-Phosphate Receptor 3 (S1P3)-Sparing S1P1 Agonists Active at Low Oral Doses. J Med Chem59:1003-20 (2016) 
 
Sphingosine 1-phosphate receptor 1
Name:Sphingosine 1-phosphate receptor 1
Type:Enzyme
Mol. Mass.:42836.02
Organism:Homo sapiens (Human)
Description:P21453
Residue:382
BDBM50149574
NameBDBM50149574
Synonyms:CHEMBL3770596
TypeSmall organic molecule
Emp. Form.C13H17ClN4OS
Mol. Mass.312.818
SMILESCC(C)Oc1ccc(cc1Cl)-c1nnc(NCCN)s1