Reaction Details
TargetSphingosine 1-phosphate receptor 1
LigandBDBM50149582
Substrate/Competitorn/a
Meas. Tech.ChEMBL_1558236 (CHEMBL3772233)
EC50 100±n/a nM
Citation Demont, EHBailey, JMBit, RABrown, JACampbell, CADeeks, NDowell, SJEldred, CGaskin, PGray, JRHaynes, AHirst, DJHolmes, DSKumar, UMorse, MAOsborne, GJRenaux, JFSeal, GASmethurst, CATaylor, SWatson, RWillis, RWitherington, J Discovery of Tetrahydropyrazolopyridine as Sphingosine 1-Phosphate Receptor 3 (S1P3)-Sparing S1P1 Agonists Active at Low Oral Doses. J Med Chem59:1003-20 (2016) 
 
Sphingosine 1-phosphate receptor 1
Name:Sphingosine 1-phosphate receptor 1
Type:Enzyme
Mol. Mass.:42836.02
Organism:Homo sapiens (Human)
Description:P21453
Residue:382
BDBM50149582
NameBDBM50149582
Synonyms:CHEMBL3770821
TypeSmall organic molecule
Emp. Form.C22H22ClN3O3S
Mol. Mass.443.946
SMILESCC(C)Oc1ccc(cc1Cl)-c1nnc(s1)N1CCc2cc(CCC(O)=O)ccc12