Reaction Details
TargetInsulin-like growth factor 1 receptor
LigandBDBM50158489
Substrate/Competitorn/a
Meas. Tech.ChEMBL_1570070 (CHEMBL3789672)
IC50 47±n/a nM
Citation Fairhurst, RAMarsilje, THStutz, SBoos, ANiklaus, MChen, BJiang, SLu, WFuret, PMcCarthy, CStauffer, FGuagnano, VVaupel, AMichellys, PYSchnell, CJeay, S Optimisation of a 5-[3-phenyl-(2-cyclic-ether)-methyl-ether]-4-aminopyrrolopyrimidine series of IGF-1R inhibitors. Bioorg Med Chem Lett26:2057-64 (2016) 
 
Insulin-like growth factor 1 receptor
Name:Insulin-like growth factor 1 receptor
Type:Protein
Mol. Mass.:154776.79
Organism:Homo sapiens (Human)
Description:P08069
Residue:1367
BDBM50158489
NameBDBM50158489
Synonyms:CHEMBL3786558
TypeSmall organic molecule
Emp. Form.C25H30N4O3
Mol. Mass.434.5307
SMILESCC12CCC(COc3cccc(c3)-c3cn([C@@H]4C[C@H](CO)C4)c4ncnc(N)c34)(CC1)O2