Reaction Details
TargetHistone deacetylase 6
LigandBDBM50156678
Substrate/Competitorn/a
Meas. Tech.ChEMBL_1571061 (CHEMBL3794847)
IC50 199±n/a nM
Citation Yoo, JKim, SJSon, DSeo, HBaek, SYMaeng, CYLee, CKim, ISJung, YHLee, SMPark, HJ Computer-aided identification of new histone deacetylase 6 selective inhibitor with anti-sepsis activity. Eur J Med Chem116:126-135 (2016) 
 
Histone deacetylase 6
Name:Histone deacetylase 6
Type:Chromatin regulator; hydrolase; repressor
Mol. Mass.:131381.51
Organism:Homo sapiens (Human)
Description:Q9UBN7
Residue:1215
BDBM50156678
NameBDBM50156678
Synonyms:CHEMBL3792392
TypeSmall organic molecule
Emp. Form.C15H16N2O2S
Mol. Mass.288.365
SMILESONC(=O)CCCc1csc(\C=C\c2ccccc2)n1