Reaction Details
TargetMAP kinase-interacting serine/threonine-protein kinase 1
LigandBDBM50170166
Substrate/Competitorn/a
Meas. Tech.ChEMBL_1577465 (CHEMBL3806738)
IC50 3920±n/a nM
Citation Cherian, JNacro, KPoh, ZYGuo, SJeyaraj, DAWong, YXHo, MYang, HYJoy, JKKwek, ZPLiu, BWee, JLOng, EHChoong, MLPoulsen, ALee, MAPendharkar, VDing, LJManoharan, VChew, YSSangthongpitag, KLim, SOng, STHill, JKeller, TH Structure-Activity Relationship Studies of Mitogen Activated Protein Kinase Interacting Kinase (MNK) 1 and 2 and BCR-ABL1 Inhibitors Targeting Chronic Myeloid Leukemic Cells. J Med Chem59:3063-78 (2016) 
 
MAP kinase-interacting serine/threonine-protein kinase 1
Name:MAP kinase-interacting serine/threonine-protein kinase 1
Type:Serine/threonine-protein kinase
Mol. Mass.:51342.85
Organism:Homo sapiens (Human)
Description:Q9BUB5
Residue:465
BDBM50170166
NameBDBM50170166
Synonyms:CHEMBL3804921
TypeSmall organic molecule
Emp. Form.C27H29F3N6O2
Mol. Mass.526.5534
SMILESCC(=O)Nc1ccc(cn1)-c1ccc(NCC(=O)Nc2ccc(CN3CCNCC3)c(c2)C(F)(F)F)cc1