Reaction Details
TargetCytochrome P450 2C9
LigandBDBM50175304
Substrate/Competitorn/a
Meas. Tech.ChEMBL_1581103 (CHEMBL3813401)
IC50 2100±n/a nM
Citation Fader, LBrault, MDesjardins, JDansereau, NLamorte, LTremblay, SBilodeau, FBordeleau, JDuplessis, MGorys, VGillard, JGleason, JLJames, CJoly, MAKuhn, CLlinas-Brunet, MLuo, LMorency, LMorin, SParisien, MPoirier, MThibeault, CTrinh, TSturino, CSrivastava, SYoakim, CFranti, M Discovery of Potent, Orally Bioavailable Inhibitors of Human Cytomegalovirus. ACS Med Chem Lett7:525-30 (2016) 
 
Cytochrome P450 2C9
Name:Cytochrome P450 2C9
Type:Enzyme
Mol. Mass.:55636.33
Organism:Homo sapiens (Human)
Description:P11712
Residue:490
BDBM50175304
NameBDBM50175304
Synonyms:CHEMBL3808842
TypeSmall organic molecule
Emp. Form.C21H16F3N5O2S
Mol. Mass.459.444
SMILESCC(c1cccc(c1)C(F)(F)F)n1cnc(c1)-n1ccc(NC(=O)c2cscn2)cc1=O