Reaction Details
TargetOxysterols receptor LXR-alpha
LigandBDBM50177016
Substrate/Competitorn/a
Meas. Tech.ChEMBL_1582624 (CHEMBL3817032)
EC50 92±n/a nM
Citation Zheng, YZhuang, LFan, KYTice, CMZhao, WDong, CLotesta, SDLeftheris, KLindblom, PRLiu, ZShimada, JNoto, PBMeng, SHardy, AHoward, LKrosky, PGuo, JLipinski, KKandpal, GBukhtiyarov, YZhao, YLala, DVan Orden, RZhou, JChen, GWu, ZMcKeever, BMMcGeehan, GMGregg, REClaremon, DASingh, SB Discovery of a Novel, Orally Efficacious Liver X Receptor (LXR)ß Agonist. J Med Chem59:3264-71 (2016) 
 
Oxysterols receptor LXR-alpha
Name:Oxysterols receptor LXR-alpha
Type:Enzyme Catalytic Domain
Mol. Mass.:50403.85
Organism:Homo sapiens (Human)
Description:Q13133
Residue:447
BDBM50177016
NameBDBM50177016
Synonyms:CHEMBL3814501
TypeSmall organic molecule
Emp. Form.C19H21ClF4N4O2S
Mol. Mass.480.907
SMILESCC(C)[C@@H]1CN(CCN1c1ncc(Cl)c(n1)C(F)(F)F)c1ccc(F)c(c1)S(C)(=O)=O