Reaction Details
TargetOxysterols receptor LXR-alpha
LigandBDBM50177017
Substrate/Competitorn/a
Meas. Tech.ChEMBL_1582624 (CHEMBL3817032)
EC50 590±n/a nM
Citation Zheng, YZhuang, LFan, KYTice, CMZhao, WDong, CLotesta, SDLeftheris, KLindblom, PRLiu, ZShimada, JNoto, PBMeng, SHardy, AHoward, LKrosky, PGuo, JLipinski, KKandpal, GBukhtiyarov, YZhao, YLala, DVan Orden, RZhou, JChen, GWu, ZMcKeever, BMMcGeehan, GMGregg, REClaremon, DASingh, SB Discovery of a Novel, Orally Efficacious Liver X Receptor (LXR)ß Agonist. J Med Chem59:3264-71 (2016) 
 
Oxysterols receptor LXR-alpha
Name:Oxysterols receptor LXR-alpha
Type:Enzyme Catalytic Domain
Mol. Mass.:50403.85
Organism:Homo sapiens (Human)
Description:Q13133
Residue:447
BDBM50177017
NameBDBM50177017
Synonyms:CHEMBL3815001 | US10144715, Compound 11-1
TypeSmall organic molecule
Emp. Form.C20H24F4N4O3S
Mol. Mass.476.488
SMILESCC(C)[C@@H]1CN(CCN1c1ncc(CO)c(n1)C(F)(F)F)c1ccc(F)c(c1)S(C)(=O)=O