Reaction Details
TargetOxysterols receptor LXR-beta
LigandBDBM50177010
Substrate/Competitorn/a
Meas. Tech.ChEMBL_1581656 (CHEMBL3817516)
IC50 0.600000±n/a nM
Citation Zheng, YZhuang, LFan, KYTice, CMZhao, WDong, CLotesta, SDLeftheris, KLindblom, PRLiu, ZShimada, JNoto, PBMeng, SHardy, AHoward, LKrosky, PGuo, JLipinski, KKandpal, GBukhtiyarov, YZhao, YLala, DVan Orden, RZhou, JChen, GWu, ZMcKeever, BMMcGeehan, GMGregg, REClaremon, DASingh, SB Discovery of a Novel, Orally Efficacious Liver X Receptor (LXR)ß Agonist. J Med Chem59:3264-71 (2016) 
 
Oxysterols receptor LXR-beta
Name:Oxysterols receptor LXR-beta
Type:Enzyme Catalytic Domain
Mol. Mass.:50978.79
Organism:Homo sapiens (Human)
Description:P55055
Residue:460
BDBM50177010
NameBDBM50177010
Synonyms:CHEMBL3814006
TypeSmall organic molecule
Emp. Form.C27H24F3NO5S3
Mol. Mass.595.673
SMILESCS(=O)(=O)c1cc(ccc1CO)-c1ccc(CN(Cc2ccccc2)S(=O)(=O)c2ccccc2C(F)(F)F)s1