Reaction Details
TargetOxysterols receptor LXR-alpha
LigandBDBM50177015
Substrate/Competitorn/a
Meas. Tech.ChEMBL_1582624 (CHEMBL3817032)
EC50 244±n/a nM
Citation Zheng, YZhuang, LFan, KYTice, CMZhao, WDong, CLotesta, SDLeftheris, KLindblom, PRLiu, ZShimada, JNoto, PBMeng, SHardy, AHoward, LKrosky, PGuo, JLipinski, KKandpal, GBukhtiyarov, YZhao, YLala, DVan Orden, RZhou, JChen, GWu, ZMcKeever, BMMcGeehan, GMGregg, REClaremon, DASingh, SB Discovery of a Novel, Orally Efficacious Liver X Receptor (LXR)ß Agonist. J Med Chem59:3264-71 (2016) 
 
Oxysterols receptor LXR-alpha
Name:Oxysterols receptor LXR-alpha
Type:Enzyme Catalytic Domain
Mol. Mass.:50403.85
Organism:Homo sapiens (Human)
Description:Q13133
Residue:447
BDBM50177015
NameBDBM50177015
Synonyms:CHEMBL3814206 | US10144715, Compound 19-1
TypeSmall organic molecule
Emp. Form.C21H27F3N4O4S
Mol. Mass.488.524
SMILESCC(C)[C@@H]1CN(CCN1c1ncc(CO)c(n1)C(F)(F)F)c1ccc(CO)c(c1)S(C)(=O)=O