Reaction Details
TargetOxysterols receptor LXR-beta
LigandBDBM50177013
Substrate/Competitorn/a
Meas. Tech.ChEMBL_1582625 (CHEMBL3817033)
EC50 2130±n/a nM
Citation Zheng, YZhuang, LFan, KYTice, CMZhao, WDong, CLotesta, SDLeftheris, KLindblom, PRLiu, ZShimada, JNoto, PBMeng, SHardy, AHoward, LKrosky, PGuo, JLipinski, KKandpal, GBukhtiyarov, YZhao, YLala, DVan Orden, RZhou, JChen, GWu, ZMcKeever, BMMcGeehan, GMGregg, REClaremon, DASingh, SB Discovery of a Novel, Orally Efficacious Liver X Receptor (LXR)ß Agonist. J Med Chem59:3264-71 (2016) 
 
Oxysterols receptor LXR-beta
Name:Oxysterols receptor LXR-beta
Type:Enzyme Catalytic Domain
Mol. Mass.:50978.79
Organism:Homo sapiens (Human)
Description:P55055
Residue:460
BDBM50177013
NameBDBM50177013
Synonyms:CHEMBL3814372
TypeSmall organic molecule
Emp. Form.C24H24F3N3O2S
Mol. Mass.475.526
SMILESCS(=O)(=O)c1cccc(c1)N1CCN(Cc2ccc(nc2)C(F)(F)F)C(C1)c1ccccc1