Reaction Details
TargetOxysterols receptor LXR-beta
LigandBDBM50177014
Substrate/Competitorn/a
Meas. Tech.ChEMBL_1582625 (CHEMBL3817033)
EC50>10000±n/a nM
Citation Zheng, YZhuang, LFan, KYTice, CMZhao, WDong, CLotesta, SDLeftheris, KLindblom, PRLiu, ZShimada, JNoto, PBMeng, SHardy, AHoward, LKrosky, PGuo, JLipinski, KKandpal, GBukhtiyarov, YZhao, YLala, DVan Orden, RZhou, JChen, GWu, ZMcKeever, BMMcGeehan, GMGregg, REClaremon, DASingh, SB Discovery of a Novel, Orally Efficacious Liver X Receptor (LXR)ß Agonist. J Med Chem59:3264-71 (2016) 
 
Oxysterols receptor LXR-beta
Name:Oxysterols receptor LXR-beta
Type:Enzyme Catalytic Domain
Mol. Mass.:50978.79
Organism:Homo sapiens (Human)
Description:P55055
Residue:460
BDBM50177014
NameBDBM50177014
Synonyms:CHEMBL3813875
TypeSmall organic molecule
Emp. Form.C22H21F3N4O2S
Mol. Mass.462.488
SMILESCS(=O)(=O)c1cccc(c1)N1CCN(C(C1)c1ccccc1)c1nccc(n1)C(F)(F)F