Reaction Details
TargetPlatelet-activating factor acetylhydrolase
LigandBDBM50182423
Substrate/Competitorn/a
Meas. Tech.ChEMBL_1584542 (CHEMBL3820397)
IC50 7100±n/a nM
Citation Woolford, AJPero, JEAravapalli, SBerdini, VCoyle, JEDay, PJDodson, AMGrondin, PHolding, FPLee, LYLi, PManas, ESMarino, JMartin, ACMcCleland, BWMcMenamin, RLMurray, CWNeipp, CEPage, LWPatel, VKPotvain, FRich, SRivero, RASmith, KSomers, DOTrottet, LVelagaleti, RWilliams, GXie, R Exploitation of a Novel Binding Pocket in Human Lipoprotein-Associated Phospholipase A2 (Lp-PLA2) Discovered through X-ray Fragment Screening. J Med Chem59:5356-67 (2016) 
 
Platelet-activating factor acetylhydrolase
Name:Platelet-activating factor acetylhydrolase
Type:PROTEIN
Mol. Mass.:50084.41
Organism:Homo sapiens (Human)
Description:ChEMBL_156212
Residue:441
BDBM50182423
NameBDBM50182423
Synonyms:CHEMBL3819367
TypeSmall organic molecule
Emp. Form.C20H22N2OS
Mol. Mass.338.466
SMILESCc1ccccc1-c1cc(Nc2nc(CCCO)cs2)ccc1C