Reaction Details
TargetPlatelet-activating factor acetylhydrolase
LigandBDBM50182430
Substrate/Competitorn/a
Meas. Tech.ChEMBL_1584540 (CHEMBL3820395)
IC50 30000±n/a nM
Citation Woolford, AJPero, JEAravapalli, SBerdini, VCoyle, JEDay, PJDodson, AMGrondin, PHolding, FPLee, LYLi, PManas, ESMarino, JMartin, ACMcCleland, BWMcMenamin, RLMurray, CWNeipp, CEPage, LWPatel, VKPotvain, FRich, SRivero, RASmith, KSomers, DOTrottet, LVelagaleti, RWilliams, GXie, R Exploitation of a Novel Binding Pocket in Human Lipoprotein-Associated Phospholipase A2 (Lp-PLA2) Discovered through X-ray Fragment Screening. J Med Chem59:5356-67 (2016) 
 
Platelet-activating factor acetylhydrolase
Name:Platelet-activating factor acetylhydrolase
Type:PROTEIN
Mol. Mass.:50084.41
Organism:Homo sapiens (Human)
Description:ChEMBL_156212
Residue:441
BDBM50182430
NameBDBM50182430
Synonyms:CHEMBL3819099
TypeSmall organic molecule
Emp. Form.C19H21NO
Mol. Mass.279.3761
SMILESCc1ccccc1-c1cc(ccc1C)C(=O)N1CCCC1