Reaction Details
TargetMaternal embryonic leucine zipper kinase
LigandBDBM50185443
Substrate/Competitorn/a
Meas. Tech.ChEMBL_1588028 (CHEMBL3824963)
IC50 0.300000±n/a nM
Citation Touré, BBGiraldes, JSmith, TSprague, ERWang, YMathieu, SChen, ZMishina, YFeng, YYan-Neale, YShakya, SChen, DMeyer, MPuleo, DBrazell, JTStraub, CSage, DWright, KYuan, YChen, XDuca, JKim, STian, LMartin, EHurov, KShao, W Toward the Validation of Maternal Embryonic Leucine Zipper Kinase: Discovery, Optimization of Highly Potent and Selective Inhibitors, and Preliminary Biology Insight. J Med Chem59:4711-23 (2016) 
 
Maternal embryonic leucine zipper kinase
Name:Maternal embryonic leucine zipper kinase
Type:Enzyme
Mol. Mass.:74665.45
Organism:Homo sapiens (Human)
Description:Q14680
Residue:651
BDBM50185443
NameBDBM50185443
Synonyms:CHEMBL3824328
TypeSmall organic molecule
Emp. Form.C24H28FN5O2
Mol. Mass.437.5098
SMILESFc1cc(ccc1-n1cc(cn1)-c1ccncc1OCC1CCNCC1)N1CCOCC1