Reaction Details
TargetMast/stem cell growth factor receptor Kit
LigandBDBM50185433
Substrate/Competitorn/a
Meas. Tech.ChEMBL_1588045 (CHEMBL3824980)
IC50>10000±n/a nM
Citation Touré, BBGiraldes, JSmith, TSprague, ERWang, YMathieu, SChen, ZMishina, YFeng, YYan-Neale, YShakya, SChen, DMeyer, MPuleo, DBrazell, JTStraub, CSage, DWright, KYuan, YChen, XDuca, JKim, STian, LMartin, EHurov, KShao, W Toward the Validation of Maternal Embryonic Leucine Zipper Kinase: Discovery, Optimization of Highly Potent and Selective Inhibitors, and Preliminary Biology Insight. J Med Chem59:4711-23 (2016) 
 
Mast/stem cell growth factor receptor Kit
Name:Mast/stem cell growth factor receptor Kit
Type:Protein
Mol. Mass.:109869.37
Organism:Homo sapiens (Human)
Description:P10721
Residue:976
BDBM50185433
NameBDBM50185433
Synonyms:CHEMBL3824068
TypeSmall organic molecule
Emp. Form.C25H32N6O
Mol. Mass.432.5612
SMILESCN1CCN(CC1)c1ccc(cc1)-n1cc(cn1)-c1ccncc1OCC1CCNCC1