Reaction Details
TargetEstrogen receptor
LigandBDBM50193253
Substrate/Competitorn/a
Meas. Tech.ChEMBL_1615022 (CHEMBL3857091)
IC50 20±n/a nM
Citation Kim, JChin, JIm, CYYoo, EKWoo, SHwang, HJCho, JHSeo, KASong, JHwang, HKim, KHKim, NDYoon, SKJeon, JHYoon, SYJeon, YHChoi, HSLee, IKKim, SHCho, SJ Synthesis and biological evaluation of novel 4-hydroxytamoxifen analogs as estrogen-related receptor gamma inverse agonists. Eur J Med Chem120:338-52 (2016) 
 
Estrogen receptor
Name:Estrogen receptor
Type:Protein
Mol. Mass.:66230.44
Organism:Homo sapiens (Human)
Description:P03372
Residue:595
BDBM50193253
NameBDBM50193253
Synonyms:CHEMBL3961676
TypeSmall organic molecule
Emp. Form.C27H31ClFNO2
Mol. Mass.455.992
SMILESCl.CN(C)CCOc1ccc(cc1)C(=C(\CCCF)c1ccccc1)\c1ccc(O)cc1