Reaction Details
TargetMu-type opioid receptor
LigandBDBM50198757
Substrate/Competitorn/a
Meas. Tech.ChEMBL_1620916 (CHEMBL3863199)
Ki 0.143000±n/a nM
Citation Weltrowska, GNguyen, TMChung, NNWood, JMa, XGuo, JWilkes, BCGe, YLaferričre, ACoderre, TJSchiller, PW A Cyclic Tetrapeptide ("Cyclodal") and Its Mirror-Image Isomer Are Both High-Affinityµ Opioid Receptor Antagonists. J Med Chem59:9243-9254 (2016) 
 
Mu-type opioid receptor
Name:Mu-type opioid receptor
Type:G Protein-Coupled Receptor (GPCR)
Mol. Mass.:44503.11
Organism:Rattus norvegicus (rat)
Description:Competition binding assays were carried out using membrane preparations from transfected HN9.10 cells that constitutively expressed the mu opioid receptor.
Residue:398
BDBM50198757
NameBDBM50198757
Synonyms:CHEMBL363142
TypeSmall organic molecule
Emp. Form.C32H49N9O5
Mol. Mass.639.7888
SMILES[#6]-c1cc(-[#8])cc(-[#6])c1-[#6]-[#6](-[#7])-[#6](=O)-[#7]-[#6@H](-[#6]-[#6]-[#6]\[#7]=[#6](/[#7])-[#7])-[#6](=O)-[#7]-[#6@@H](-[#6]-c1ccccc1)-[#6](=O)-[#7]-[#6@@H](-[#6]-[#6]-[#6]-[#6]-[#7])-[#6](-[#7])=O