Reaction Details
TargetKappa-type opioid receptor
LigandBDBM50252861
Substrate/Competitorn/a
Meas. Tech.ChEMBL_1620918 (CHEMBL3863201)
Ki 14900±n/a nM
Citation Weltrowska, GNguyen, TMChung, NNWood, JMa, XGuo, JWilkes, BCGe, YLaferričre, ACoderre, TJSchiller, PW A Cyclic Tetrapeptide ("Cyclodal") and Its Mirror-Image Isomer Are Both High-Affinityµ Opioid Receptor Antagonists. J Med Chem59:9243-9254 (2016) 
 
Kappa-type opioid receptor
Name:Kappa-type opioid receptor
Type:G Protein-Coupled Receptor (GPCR)
Mol. Mass.:42744.99
Organism:Cavia porcellus (domestic guinea pig)
Description:P41144
Residue:380
BDBM50252861
NameBDBM50252861
Synonyms:CHEMBL507214 | H-D-Phe-c[Cys-Tyr-DTrp-Orn-Thr-Pen]-Thr-NH2
TypeSmall organic molecule
Emp. Form.C50H67N11O11S2
Mol. Mass.1062.264
SMILESC[C@@H](O)[C@H](NC(=O)[C@H]1NC(=O)[C@@H](NC(=O)[C@H](CCCN)NC(=O)[C@@H](Cc2c[nH]c3ccccc23)NC(=O)[C@H](Cc2ccc(O)cc2)NC(=O)[C@H](CSSC1(C)C)NC(=O)[C@H](N)Cc1ccccc1)[C@@H](C)O)C(N)=O