Reaction Details
TargetDelta-type opioid receptor
LigandBDBM50003238
Substrate/Competitorn/a
Meas. Tech.ChEBML_1643867
IC50 40±n/a nM
Citation Chen, SRKe, YYYeh, TKLin, SYOu, LCChen, SCChang, WTChang, HFWu, ZHHsieh, CCLaw, PYLoh, HHShih, CLai, YKYeh, SHUeng, SH Discovery, structure-activity relationship studies, and anti-nociceptive effects of N-(1,2,3,4-tetrahydro-1-isoquinolinylmethyl)benzamides as novel opioid receptor agonists. Eur J Med Chem126:202-217 (2017) 
 
Delta-type opioid receptor
Name:Delta-type opioid receptor
Type:G Protein-Coupled Receptor (GPCR)
Mol. Mass.:40382.98
Organism:Homo sapiens (Human)
Description:Competition binding assays were carried out using membrane preparations from transfected HN9.10 cells that constitutively expressed the delta opioid receptor.
Residue:372
BDBM50003238
NameBDBM50003238
Synonyms:CHEMBL4082299
TypeSmall organic molecule
Emp. Form.C18H17F3N2O2
Mol. Mass.350.335
SMILESFC(F)(F)Oc1ccc(cc1)C(=O)NCC1NCCc2ccccc12