Reaction Details
TargetMu-type opioid receptor
LigandBDBM50008521
Substrate/Competitorn/a
Meas. Tech.ChEMBL_1643866 (CHEMBL3992795)
IC50 200±n/a nM
Citation Chen, SRKe, YYYeh, TKLin, SYOu, LCChen, SCChang, WTChang, HFWu, ZHHsieh, CCLaw, PYLoh, HHShih, CLai, YKYeh, SHUeng, SH Discovery, structure-activity relationship studies, and anti-nociceptive effects of N-(1,2,3,4-tetrahydro-1-isoquinolinylmethyl)benzamides as novel opioid receptor agonists. Eur J Med Chem126:202-217 (2017) 
 
Mu-type opioid receptor
Name:Mu-type opioid receptor
Type:G Protein-Coupled Receptor (GPCR)
Mol. Mass.:44789.51
Organism:Homo sapiens (Human)
Description:P35372
Residue:400
BDBM50008521
NameBDBM50008521
Synonyms:CHEMBL4061620
TypeSmall organic molecule
Emp. Form.C20H23ClN2O
Mol. Mass.342.862
SMILESCc1ccc(cc1)C(=O)NCC1N(CCCl)CCc2ccccc12