Reaction Details
TargetMu-type opioid receptor
LigandBDBM50003169
Substrate/Competitorn/a
Meas. Tech.ChEMBL_1643864 (CHEMBL3992793)
EC50 380±n/a nM
Citation Chen, SRKe, YYYeh, TKLin, SYOu, LCChen, SCChang, WTChang, HFWu, ZHHsieh, CCLaw, PYLoh, HHShih, CLai, YKYeh, SHUeng, SH Discovery, structure-activity relationship studies, and anti-nociceptive effects of N-(1,2,3,4-tetrahydro-1-isoquinolinylmethyl)benzamides as novel opioid receptor agonists. Eur J Med Chem126:202-217 (2017) 
 
Mu-type opioid receptor
Name:Mu-type opioid receptor
Type:G Protein-Coupled Receptor (GPCR)
Mol. Mass.:44789.51
Organism:Homo sapiens (Human)
Description:P35372
Residue:400
BDBM50003169
NameBDBM50003169
Synonyms:CHEMBL4066436
TypeSmall organic molecule
Emp. Form.C17H17ClN2O
Mol. Mass.300.783
SMILESClc1cccc(c1)C(=O)NCC1NCCc2ccccc12