Reaction Details
TargetMu-type opioid receptor
LigandBDBM50042758
Substrate/Competitorn/a
Meas. Tech.ChEMBL_1643864 (CHEMBL3992793)
EC50 3310±n/a nM
Citation Chen, SRKe, YYYeh, TKLin, SYOu, LCChen, SCChang, WTChang, HFWu, ZHHsieh, CCLaw, PYLoh, HHShih, CLai, YKYeh, SHUeng, SH Discovery, structure-activity relationship studies, and anti-nociceptive effects of N-(1,2,3,4-tetrahydro-1-isoquinolinylmethyl)benzamides as novel opioid receptor agonists. Eur J Med Chem126:202-217 (2017) 
 
Mu-type opioid receptor
Name:Mu-type opioid receptor
Type:G Protein-Coupled Receptor (GPCR)
Mol. Mass.:44789.51
Organism:Homo sapiens (Human)
Description:P35372
Residue:400
BDBM50042758
NameBDBM50042758
Synonyms:CHEMBL4091515
TypeSmall organic molecule
Emp. Form.C16H23N3O
Mol. Mass.273.3733
SMILESO=C(NCC1NCCc2ccccc12)N1CCCCC1