Reaction Details
TargetMicrotubule-associated protein 2
LigandBDBM50234032
Substrate/Competitorn/a
Meas. Tech.ChEMBL_1651976 (CHEMBL4001231)
IC50 38±n/a nM
Citation Heinrich, TBuchstaller, HPCezanne, BRohdich, FBomke, JFriese-Hamim, MKrier, MKnöchel, TMusil, DLeuthner, BZenke, F Novel reversible methionine aminopeptidase-2 (MetAP-2) inhibitors based on purine and related bicyclic templates. Bioorg Med Chem Lett27:551-556 (2017) 
 
Microtubule-associated protein 2
Name:Microtubule-associated protein 2
Type:PROTEIN
Mol. Mass.:199423.64
Organism:Homo sapiens (Human)
Description:ChEMBL_107603
Residue:1827
BDBM50234032
NameBDBM50234032
Synonyms:CHEMBL4060668
TypeSmall organic molecule
Emp. Form.C19H18N6O
Mol. Mass.346.3858
SMILESC(Oc1cncc2ccccc12)[C@H]1CCCN1c1ccnc2ncnn12