Reaction Details
TargetCytochrome P450 3A4
LigandBDBM151585
Substrate/Competitorn/a
Meas. Tech.ChEMBL_1655303 (CHEMBL4004669)
IC50 18±n/a nM
Citation Metcalf, BChuang, CDufu, KPatel, MPSilva-Garcia, AJohnson, CLu, QPartridge, JRPatskovska, LPatskovsky, YAlmo, SCJacobson, MPHua, LXu, QGwaltney, SLYee, CHarris, JMorgan, BPJames, JXu, DHutchaleelaha, APaulvannan, KOksenberg, DLi, Z Discovery of GBT440, an Orally Bioavailable R-State Stabilizer of Sickle Cell Hemoglobin. ACS Med Chem Lett8:321-326 (2017) 
 
Cytochrome P450 3A4
Name:Cytochrome P450 3A4
Type:Enzyme
Mol. Mass.:57349.57
Organism:Homo sapiens (Human)
Description:n/a
Residue:503
BDBM151585
NameBDBM151585
Synonyms:US11739089, Compound Ketoconazole US9180183, Ketoconazole US9394290, KTZ (ketoconazole) | US9963439, Ketoconazole
TypeSmall organic molecule
Emp. Form.C26H28Cl2N4O4
Mol. Mass.531.431
SMILESCC(=O)N1CCN(CC1)c1ccc(OCC2COC(Cn3ccnc3)(O2)c2ccc(Cl)cc2Cl)cc1