Reaction Details
TargetHistone-lysine N-methyltransferase, H3 lysine-79 specific
LigandBDBM50235302
Substrate/Competitorn/a
Meas. Tech.ChEMBL_1655314 (CHEMBL4004680)
IC50 3.0±n/a nM
Citation Möbitz, HMachauer, RHolzer, PVaupel, AStauffer, FRagot, CCaravatti, GScheufler, CFernandez, CHommel, UTiedt, RBeyer, KSChen, CZhu, HGaul, C Discovery of Potent, Selective, and Structurally Novel Dot1L Inhibitors by a Fragment Linking Approach. ACS Med Chem Lett8:338-343 (2017) 
 
Histone-lysine N-methyltransferase, H3 lysine-79 specific
Name:Histone-lysine N-methyltransferase, H3 lysine-79 specific
Type:Protein
Mol. Mass.:184911.91
Organism:Homo sapiens (Human)
Description:Q8TEK3
Residue:1537
BDBM50235302
NameBDBM50235302
Synonyms:CHEMBL4099771
TypeSmall organic molecule
Emp. Form.C32H36ClN9O2S
Mol. Mass.646.205
SMILESCN(CCCNC(=O)CNC(=O)Nc1ccc2sc(Cl)c(-c3cccnc3C)c2c1)[C@@H]1CCCN(C1)c1ncnc2[nH]ccc12